Target
Caspase-8
Ligand
BDBM29581
Substrate
Caspase-8 Substrate
Meas. Tech.
Enzyme Inhibition Assay
IC50
>50000±n/a nM
Citation
 Chu, WRothfuss, JChu, YZhou, DMach, RH Synthesis and in vitro evaluation of sulfonamide isatin Michael acceptors as small molecule inhibitors of caspase-6. J Med Chem 52:2188-91 (2009)  
Target
Name:
Caspase-8
Synonyms:
Apoptotic cysteine protease CAP4 CASP8 Caspase Caspase-8 subunit p18 FADD-like ICE ICE-like apoptotic protease 5 MCH5 | MORT1-associated CED-3 homolog
Type:
Enzyme
Mol. Mass.:
55373.89
Organism:
Homo sapiens (Human)
Description:
Q14790
Residue:
479
  
Inhibitor
Name:
BDBM29581
Synonyms:
isatin sulfonamide, 16a
Type:
Small organic molecule
Emp. Form.:
C18H16N2O4S
Mol. Mass.:
356.396
SMILES:
O=C1N(Cc2ccccc2)c2ccc(cc2C1=O)S(=O)(=O)N1CCC1
:
Substrate
Name:
Caspase-8 Substrate
Synonyms:
N-Acetyl-Ile-Glu-Thr-Asp-7-Amido-4-methylcoumarin
Type:
Fluorogenic Substrate
Mol. Mass.:
954.10
Organism:
Description:
Residue:
9
ACIETDAMC