Target
Caspase-6
Ligand
BDBM29576
Substrate
Caspase-6 Substrate
Meas. Tech.
Enzyme Inhibition Assay
IC50
453±n/a nM
Citation
 Chu, WRothfuss, JChu, YZhou, DMach, RH Synthesis and in vitro evaluation of sulfonamide isatin Michael acceptors as small molecule inhibitors of caspase-6. J Med Chem 52:2188-91 (2009)  
Target
Name:
Caspase-6
Synonyms:
Apoptotic protease Mch-2 CASP6 Caspase | MCH2
Type:
Enzyme
Mol. Mass.:
33312.62
Organism:
Homo sapiens (Human)
Description:
P55212
Residue:
293
  
Inhibitor
Name:
BDBM29576
Synonyms:
isatin Michael acceptor (IMA) analogue, 12b
Type:
Small organic molecule
Emp. Form.:
C23H20N4O5S
Mol. Mass.:
464.494
SMILES:
[#6]-[#8]-c1ccc(-[#6]-[#7]-2-[#6](=O)\[#6](=[#6](\C#N)C#N)-c3cc(ccc-23)S(=O)(=O)[#7]-2-[#6]-[#6]-[#8]-[#6]-[#6]-2)cc1
:
Substrate
Name:
Caspase-6 Substrate
Synonyms:
N-Acetyl-Val-Glu-Ile-Asp-7-amido-4-methylcoumarin
Type:
Fluorogenic Substrate
Mol. Mass.:
952.13
Organism:
Description:
Residue:
9
ACVEIDAMC