Target
Caspase-3
Ligand
BDBM10323
Substrate
Caspase-3 Substrate
Meas. Tech.
Enzyme Inhibition Assay
IC50
14.5±n/a nM
Citation
 Chu, WRothfuss, JChu, YZhou, DMach, RH Synthesis and in vitro evaluation of sulfonamide isatin Michael acceptors as small molecule inhibitors of caspase-6. J Med Chem 52:2188-91 (2009)  
Target
Name:
Caspase-3
Synonyms:
Apopain CASP3 CPP-32 Caspase 3 Caspase-3 subunit p17 SCA-1 Yama protein | caspase-3 preproprotein
Type:
Hydrolase; heterotetramer of two heterodimers
Mol. Mass.:
31607.55
Organism:
Homo sapiens (Human)
Description:
Residue:
277
  
Inhibitor
Name:
BDBM10323
Synonyms:
(S)-1-Benzyl-5-{1-[2-(phenoxymethyl)pyrrolidinyl]sulfonyl}isatin CHEMBL439753 Isatin Sulfonamide 34 Pyrrolidine Isatin Analogue 2
Type:
Small organic molecule
Emp. Form.:
C26H24N2O5S
Mol. Mass.:
476.544
SMILES:
O=C1N(Cc2ccccc2)c2ccc(cc2C1=O)S(=O)(=O)N1CCC[C@H]1COc1ccccc1
:
Substrate
Name:
Caspase-3 Substrate
Synonyms:
N-Acetyl-Asp-Glu-Val-Asp-7-amido-4-methylcoumarin
Type:
Fluorogenic Substrate
Mol. Mass.:
953.05
Organism:
Description:
Residue:
9
ACDEVDAMC