Target
Potassium-transporting ATPase alpha chain 1
Ligand
BDBM394377
Substrate
Meas. Tech.
Proton Potassium-adenosine Triphosphatase (H+,K+-ATPase) Inhibitory Activity
IC50
91.0±n/a nM
Citation
 Kajino, MHasuoka, ATarui, NTakagi, T Proton pump inhibitors US Patent  US10308605 Publication Date 6/4/2019 
Target
Name:
Potassium-transporting ATPase alpha chain 1
Synonyms:
ATP4A Gastric H(+)/K(+) ATPase subunit alpha Na/K-ATPase Potassium-transporting ATPase alpha chain 1 | Proton pump
Type:
Enzyme
Mol. Mass.:
114279.23
Organism:
Sus scrofa (Pig)
Description:
P19156
Residue:
1034
  
Inhibitor
Name:
BDBM394377
Synonyms:
N-Methyl-1-{5-(3-methylphenyl)-1-[(4-methylphenyl)sulfonyl]-1H-pyrrol-3-yl}methanamine | US10308605, Example 7
Type:
Small organic molecule
Emp. Form.:
C20H22N2O2S
Mol. Mass.:
354.466
SMILES:
CNCc1cc(-c2cccc(C)c2)n(c1)S(=O)(=O)c1ccc(C)cc1
: