Target
Runt-related transcription factor 1
Ligand
BDBM29660
Substrate
Venus-CBFbeta-SMMHC
Meas. Tech.
Identification of compounds inhibiting the binding between the RUNX1 Runt domain and CBFbeta-SMMHC via a time resolved fluorescence resonance energy transfer (TR-FRET) assay.
pH
7.4±n/a
Temperature
296.15±n/a K
IC50
100000±n/a nM
Citation
 PubChem, PC Identification of compounds inhibiting the binding between the RUNX1 Runt domain and CBFb-SMMHC via a time resolved fluorescence resonance energy transfer (TR-FRET) assay. PubChem Bioassay (2009)[AID] 
Target
Name:
Runt-related transcription factor 1
Synonyms:
AML1 CBF-alpha-2 Core-binding factor subunit alpha-2 Polyomavirus enhancer-binding protein 2 alpha B subunit RUNX1_HUMAN | Runt-Related Transcription Factor 1 Isoform AML1C
Type:
Subunit of heterodimeric transcription factor
Mol. Mass.:
48750.25
Organism:
Homo sapiens (Human)
Description:
Q01196
Residue:
453
  
Inhibitor
Name:
BDBM29660
Synonyms:
2-Amino-4-furan-2-yl-7-methyl-5-oxo-6-phenethyl-5,6-dihydro-4H-pyrano[3,2-c]pyridine-3-carbonitrile 2-amino-4-(2-furyl)-5-keto-7-methyl-6-phenethyl-4H-pyrano[3,2-c]pyridine-3-carbonitrile 2-azanyl-4-(furan-2-yl)-7-methyl-5-oxidanylidene-6-(2-phenylethyl)-4H-pyrano[3,2-c]pyridine-3-carbonitrile SMR000149533 | cid_3474243
Type:
Small organic molecule
Emp. Form.:
C22H19N3O3
Mol. Mass.:
373.4046
SMILES:
Cc1cc2OC(=N)C(C#N)C(c3ccco3)c2c(=O)n1CCc1ccccc1
:
Substrate
Name:
Core-binding factor subunit beta isoform 2
Synonyms:
CBFB PEBB_HUMAN Venus-core-binding factor subunit beta-smooth muscle myosin heavy chain
Type:
Fluorescent fusion protein
Mol. Mass.:
21988.19
Organism:
Homo sapiens (Human)
Description:
Q13951-2
Residue:
187