Target
Runt-related transcription factor 1
Ligand
BDBM29687
Substrate
Venus-CBFbeta-SMMHC
Meas. Tech.
Identification of compounds inhibiting the binding between the RUNX1 Runt domain and CBFbeta-SMMHC via a time resolved fluorescence resonance energy transfer (TR-FRET) assay.
pH
7.4±n/a
Temperature
296.15±n/a K
IC50
20500±n/a nM
Citation
 PubChem, PC Identification of compounds inhibiting the binding between the RUNX1 Runt domain and CBFb-SMMHC via a time resolved fluorescence resonance energy transfer (TR-FRET) assay. PubChem Bioassay (2009)[AID] 
Target
Name:
Runt-related transcription factor 1
Synonyms:
AML1 CBF-alpha-2 Core-binding factor subunit alpha-2 Polyomavirus enhancer-binding protein 2 alpha B subunit RUNX1_HUMAN | Runt-Related Transcription Factor 1 Isoform AML1C
Type:
Subunit of heterodimeric transcription factor
Mol. Mass.:
48750.25
Organism:
Homo sapiens (Human)
Description:
Q01196
Residue:
453
  
Inhibitor
Name:
BDBM29687
Synonyms:
2-(1,2,3-thiadiazol-5-yl)-1,4-benzenediol 2-(2,3-dihydrothiadiazol-5-yl)-p-benzoquinone MLS000698998 cid_5412885
Type:
Small organic molecule
Emp. Form.:
C8H6N2O2S
Mol. Mass.:
194.21
SMILES:
Oc1ccc(O)c(c1)-c1cnns1
:
Substrate
Name:
Core-binding factor subunit beta isoform 2
Synonyms:
CBFB PEBB_HUMAN Venus-core-binding factor subunit beta-smooth muscle myosin heavy chain
Type:
Fluorescent fusion protein
Mol. Mass.:
21988.19
Organism:
Homo sapiens (Human)
Description:
Q13951-2
Residue:
187