Target
Transcription activator BRG1 [1448-1575]
Ligand
BDBM394446
Substrate
Meas. Tech.
BRG1 TR-FRET Binding Assay
IC50
4.50±n/a nM
Citation
 Albrecht, BKCote, ACrawford, TDuplessis, MGood, ACLeBlanc, YMagnuson, SRNasveschuk, CGRomero, FATang, YTaylor, AM Therapeutic compounds and uses thereof US Patent  US10308614 Publication Date 6/4/2019 
Target
Name:
Transcription activator BRG1 [1448-1575]
Synonyms:
ATP-dependent helicase SMARCA4 BRG1 SMARCA4 SNF2B Transcription activator BRG1
Type:
Enzyme Catalytic Domain
Mol. Mass.:
14937.42
Organism:
Homo sapiens (Human)
Description:
P51532(A1448-S1575)
Residue:
128
  
Inhibitor
Name:
BDBM394446
Synonyms:
2-(6-amino-5-(8-(2- | US10308614, Example 47
Type:
Small organic molecule
Emp. Form.:
C21H21FN6O
Mol. Mass.:
392.4294
SMILES:
Nc1nnc(cc1N1CC2CCC(C1)N2c1ccnc(F)c1)-c1ccccc1O
: