Target
Beta-secretase 1 [1-453]
Ligand
BDBM29750
Substrate
BACE Peptide Substrate
Meas. Tech.
Enzyme Inhibition Measurements
pH
4.5±n/a
Temperature
295.15±n/a K
IC50
250±n/a nM
Citation
 Machauer, RVeenstra, SRondeau, JMTintelnot-Blomley, MBetschart, CNeumann, UPaganetti, P Structure-based design and synthesis of macrocyclic peptidomimetic beta-secretase (BACE-1) inhibitors. Bioorg Med Chem Lett 19:1361-5 (2009)  
Target
Name:
Beta-secretase 1 [1-453]
Synonyms:
ASP2 Aspartyl protease 2 BACE1 Beta-site APP cleaving enzyme 1 KIAA1149 Membrane-associated aspartic protease 2 | beta-Secretase (BACE-1)
Type:
Enzyme
Mol. Mass.:
50193.81
Organism:
Homo sapiens (Human)
Description:
Recombinant human BACE (SwissProt accession number P56817, amino acids 1-453 + a thrombin-cleavable C-kappa tag) was produced in-house using Sf9 insect cells.
Residue:
453
  
Inhibitor
Name:
BDBM29750
Synonyms:
macrocyclic peptidomimetic, 3d
Type:
Small organic molecule
Emp. Form.:
C25H47N3O4
Mol. Mass.:
453.6584
SMILES:
CCCCNC(=O)[C@H](C)C[C@H](O)[C@@H]1C[C@H](C)CCCCCCCCC(=O)N[C@@H](C)C(=O)N1
:
Substrate
Name:
BACE Peptide Substrate
Synonyms:
Type:
Peptide
Mol. Mass.:
1917.56
Organism:
Description:
Peptide substrates were obtained from Bachem (Bubendorf, Switzerland).
Residue:
17
MCASEVNLDAEFKDNPH