Target
Cathepsin D
Ligand
BDBM29744
Substrate
Cathepsin D Peptide Substrate
Meas. Tech.
Enzyme Inhibition Measurements
pH
3.1±n/a
Temperature
295.15±n/a K
IC50
370±n/a nM
Citation
 Machauer, RVeenstra, SRondeau, JMTintelnot-Blomley, MBetschart, CNeumann, UPaganetti, P Structure-based design and synthesis of macrocyclic peptidomimetic beta-secretase (BACE-1) inhibitors. Bioorg Med Chem Lett 19:1361-5 (2009)  
Target
Name:
Cathepsin D
Synonyms:
CATD_HUMAN CTSD Cathepsin D heavy chain Cathepsin D precursor
Type:
Enzyme
Mol. Mass.:
44551.72
Organism:
Homo sapiens (Human)
Description:
Human proCathepsin D (SwissProt accession number P07339) was expressed in Sf9 cells, purified, and autoactivated.
Residue:
412
  
Inhibitor
Name:
BDBM29744
Synonyms:
hydroxyethylene tripeptide inhibitor, 1
Type:
Small organic molecule
Emp. Form.:
C25H49N3O4S
Mol. Mass.:
487.739
SMILES:
CCCCNC(=O)[C@H](C)C[C@H](O)[C@H](CC(C)C)NC(=O)[C@H](CCSC)NC(=O)CCC(C)C
:
Substrate
Name:
Cathepsin D Peptide Substrate
Synonyms:
Type:
Peptide
Mol. Mass.:
2375.29
Organism:
Description:
Peptide substrates were obtained from Bachem (Bubendorf, Switzerland).
Residue:
20