Target
Pantetheinase
Ligand
BDBM395118
Substrate
Meas. Tech.
Human Vanin-1 Enzyme Assay 1
IC50
9.90±n/a nM
Citation
 Casimiro-Garcia, ACondon, JSFlick, ACGopalsamy, AKirincich, SJMathias, JPStrobach, JWXiang, JSXing, LHWang, X Heterocyclic compounds as inhibitors of Vanin-1 enzyme US Patent  US10308615 Publication Date 6/4/2019 
Target
Name:
Pantetheinase
Synonyms:
Pantetheine hydrolase VNN1 Vanin-1 | Vascular non-inflammatory molecule 1
Type:
Enzyme Catalytic Domain
Mol. Mass.:
57002.46
Organism:
Homo sapiens (Human)
Description:
O95497
Residue:
513
  
Inhibitor
Name:
BDBM395118
Synonyms:
3-({2-[(1- phenylcyclobutyl) amino]pyrimidin- 5- yl}carbonyl) benzonitrile | US10308615, Example 129
Type:
Small organic molecule
Emp. Form.:
C22H18N4O
Mol. Mass.:
354.4045
SMILES:
O=C(c1cnc(NC2(CCC2)c2ccccc2)nc1)c1cccc(c1)C#N
: