Target
Muscarinic acetylcholine receptor M1
Ligand
BDBM395183
Substrate
Meas. Tech.
Determination of Allosteric Potency EC50 Values for Muscarinic M1 Receptor
EC50
140±n/a nM
Citation
 Nirogi, RMohammed, ARShinde, AKGagginapally, SRJasti, V Muscarinic M1 receptor positive allosteric modulators US Patent  US10308620 Publication Date 6/4/2019 
Target
Name:
Muscarinic acetylcholine receptor M1
Synonyms:
ACM1_HUMAN Cholinergic receptor, muscarinic 1 | Cholinergic, muscarinic M1
Type:
Protein
Mol. Mass.:
51442.54
Organism:
Homo sapiens (Human)
Description:
P11229
Residue:
460
  
Inhibitor
Name:
BDBM395183
Synonyms:
US10308620, Example 29
Type:
Small organic molecule
Emp. Form.:
C22H21F3N2O3
Mol. Mass.:
418.4089
SMILES:
O[C@H]1CCCC[C@@H]1NC(=O)C1=CN(Cc2cccc(F)c2F)c2cccc(F)c2O1
: