Target
Muscarinic acetylcholine receptor M1
Ligand
BDBM395190
Substrate
Meas. Tech.
Determination of Allosteric Potency EC50 Values for Muscarinic M1 Receptor
EC50
534±n/a nM
Citation
 Nirogi, RMohammed, ARShinde, AKGagginapally, SRJasti, V Muscarinic M1 receptor positive allosteric modulators US Patent  US10308620 Publication Date 6/4/2019 
Target
Name:
Muscarinic acetylcholine receptor M1
Synonyms:
ACM1_HUMAN Cholinergic receptor, muscarinic 1 | Cholinergic, muscarinic M1
Type:
Protein
Mol. Mass.:
51442.54
Organism:
Homo sapiens (Human)
Description:
P11229
Residue:
460
  
Inhibitor
Name:
BDBM395190
Synonyms:
US10308620, Example 37
Type:
Small organic molecule
Emp. Form.:
C23H23F3N2O3
Mol. Mass.:
432.4355
SMILES:
O[C@H]1CCCC[C@@H]1NC(=O)C1=CN(Cc2ccccc2C(F)(F)F)c2ccccc2O1
: