Target
Muscarinic acetylcholine receptor M1
Ligand
BDBM395213
Substrate
Meas. Tech.
Determination of Allosteric Potency EC50 Values for Muscarinic M1 Receptor
EC50
2100±n/a nM
Citation
 Nirogi, RMohammed, ARShinde, AKGagginapally, SRJasti, V Muscarinic M1 receptor positive allosteric modulators US Patent  US10308620 Publication Date 6/4/2019 
Target
Name:
Muscarinic acetylcholine receptor M1
Synonyms:
ACM1_HUMAN Cholinergic receptor, muscarinic 1 | Cholinergic, muscarinic M1
Type:
Protein
Mol. Mass.:
51442.54
Organism:
Homo sapiens (Human)
Description:
P11229
Residue:
460
  
Inhibitor
Name:
BDBM395213
Synonyms:
N-(3-Fluoropiperidin-4-yl)-4-(2,3-difluorobenzyl)-8-fluoro-4H-benzo[1,4]oxazine-2-carboxamide hydrochloride | US10308620, Example 74
Type:
Small organic molecule
Emp. Form.:
C21H19F4N3O2
Mol. Mass.:
421.3881
SMILES:
FC1CNCCC1NC(=O)C1=CN(Cc2cccc(F)c2F)c2cccc(F)c2O1
: