Target
Mitotic checkpoint serine/threonine-protein kinase BUB1
Ligand
BDBM395241
Substrate
Meas. Tech.
Bub1 Kinase Assay
IC50
648±n/a nM
Citation
 Graham, KKlar, UBriem, HSiemeister, GMönning, U 1H-pyrrol-3-amines US Patent  US10308629 Publication Date 6/4/2019 
Target
Name:
Mitotic checkpoint serine/threonine-protein kinase BUB1
Synonyms:
BUB1 BUB1L hBUB1
Type:
PROTEIN
Mol. Mass.:
122372.31
Organism:
Homo sapiens (Human)
Description:
ChEMBL_1510603
Residue:
1085
  
Inhibitor
Name:
BDBM395241
Synonyms:
(5R,7S or 5S,7R)-2-(2-Aminopyridin-4-yl)-6,6-dimethyl-3-(phenylamino)-1,5,6,7-tetrahydro-4H-5,7-methanoindol-4-one US10308629, Example 4
Type:
Small organic molecule
Emp. Form.:
C22H22N4O
Mol. Mass.:
358.4363
SMILES:
CC1(C)[C@H]2C[C@@H]1C(=O)c1c(Nc3ccccc3)c([nH]c21)-c1ccnc(N)c1
: