Target
Mitotic checkpoint serine/threonine-protein kinase BUB1
Ligand
BDBM395250
Substrate
Meas. Tech.
Bub1 Kinase Assay
IC50
7.00±n/a nM
Citation
 Graham, KKlar, UBriem, HSiemeister, GMönning, U 1H-pyrrol-3-amines US Patent  US10308629 Publication Date 6/4/2019 
Target
Name:
Mitotic checkpoint serine/threonine-protein kinase BUB1
Synonyms:
BUB1 BUB1L hBUB1
Type:
PROTEIN
Mol. Mass.:
122372.31
Organism:
Homo sapiens (Human)
Description:
ChEMBL_1510603
Residue:
1085
  
Inhibitor
Name:
BDBM395250
Synonyms:
US10308629, Example 12 | rel-(4aR,5aR)-3-(Phenylamino)-2-(pyridin-4-yl)-4a,5,5a,6-tetrahydrocyclopropa[f]indol-4(1H)-one
Type:
Small organic molecule
Emp. Form.:
C14H15NO3S
Mol. Mass.:
277.339
SMILES:
OCC1CC(O)=C(C(=S)Nc2ccccc2)C(=O)C1
: