Target
Mitotic checkpoint serine/threonine-protein kinase BUB1
Ligand
BDBM395260
Substrate
Meas. Tech.
Bub1 Kinase Assay
IC50
6.00±n/a nM
Citation
 Graham, KKlar, UBriem, HSiemeister, GMönning, U 1H-pyrrol-3-amines US Patent  US10308629 Publication Date 6/4/2019 
Target
Name:
Mitotic checkpoint serine/threonine-protein kinase BUB1
Synonyms:
BUB1 BUB1L hBUB1
Type:
PROTEIN
Mol. Mass.:
122372.31
Organism:
Homo sapiens (Human)
Description:
ChEMBL_1510603
Residue:
1085
  
Inhibitor
Name:
BDBM395260
Synonyms:
3-(Phenylamino)-2-(pyridin-4-yl)-5,6,7,8-tetrahydrocyclohepta[b]pyrrol-4(1H)-one | US10308629, Example 22
Type:
Small organic molecule
Emp. Form.:
C20H17N3O
Mol. Mass.:
315.3685
SMILES:
O=C1CCC=Cc2[nH]c(c(Nc3ccccc3)c12)-c1ccncc1
: