Target
Mitotic checkpoint serine/threonine-protein kinase BUB1
Ligand
BDBM395265
Substrate
Meas. Tech.
Bub1 Kinase Assay
IC50
133±n/a nM
Citation
 Graham, KKlar, UBriem, HSiemeister, GMönning, U 1H-pyrrol-3-amines US Patent  US10308629 Publication Date 6/4/2019 
Target
Name:
Mitotic checkpoint serine/threonine-protein kinase BUB1
Synonyms:
BUB1 BUB1L hBUB1
Type:
PROTEIN
Mol. Mass.:
122372.31
Organism:
Homo sapiens (Human)
Description:
ChEMBL_1510603
Residue:
1085
  
Inhibitor
Name:
BDBM395265
Synonyms:
1-Fluoro-N-4-[rel-(4aS,5aR)-5a-methyl-4,6-dioxo-3-(phenylamino)-1,4,4a,5,5a,6-hexahydrocyclopropa[f]indol-2-yl]pyridin-2-ylcyclopropanecarboxamide | US10308629, Example 29
Type:
Small organic molecule
Emp. Form.:
C25H21FN4O3
Mol. Mass.:
444.4576
SMILES:
C[C@@]12C[C@@H]1C(=O)c1c(Nc3ccccc3)c([nH]c1C2=O)-c1ccnc(NC(=O)C2(F)CC2)c1
: