Target
Protein kinase C theta type
Ligand
BDBM29819
Substrate
PKC Peptide Substrate
Meas. Tech.
PKC theta IMAP Kinase Assay
pH
7.2±n/a
Temperature
295.15±n/a K
IC50
6300±n/a nM
Citation
 Dushin, RGNittoli, TIngalls, CBoschelli, DHCole, DCWissner, ALee, JYang, XMorgan, PBrennan, AChaudhary, D Synthesis and PKCtheta inhibitory activity of a series of 4-indolylamino-5-phenyl-3-pyridinecarbonitriles. Bioorg Med Chem Lett 19:2461-3 (2009)  
Target
Name:
Protein kinase C theta type
Synonyms:
KPCT_HUMAN PRKCT Protein kinase C theta type (PRKCQ) nPKC-theta
Type:
Serine/threonine-protein kinase
Mol. Mass.:
81878.04
Organism:
Homo sapiens (Human)
Description:
Full-length human PKC theta (Panvera Catalog No. P2996).
Residue:
706
  
Inhibitor
Name:
BDBM29819
Synonyms:
4-indolylamino-5-phenyl-3-pyridinecarbonitrile, 7c
Type:
Small organic molecule
Emp. Form.:
C24H22N4O3
Mol. Mass.:
414.4565
SMILES:
COCCOc1cc(ccc1OC)-c1cncc(C#N)c1Nc1ccc2cc[nH]c2c1
:
Substrate
Name:
PKC Peptide Substrate
Synonyms:
Type:
Fluorescent peptide
Mol. Mass.:
2051.95
Organism:
Description:
Residue:
17
FAMRFARKGSLRQKNVH