Target
Protein kinase C theta type
Ligand
BDBM29820
Substrate
PKC Peptide Substrate
Meas. Tech.
PKC theta IMAP Kinase Assay
pH
7.2±n/a
Temperature
295.15±n/a K
IC50
32±n/a nM
Citation
 Dushin, RGNittoli, TIngalls, CBoschelli, DHCole, DCWissner, ALee, JYang, XMorgan, PBrennan, AChaudhary, D Synthesis and PKCtheta inhibitory activity of a series of 4-indolylamino-5-phenyl-3-pyridinecarbonitriles. Bioorg Med Chem Lett 19:2461-3 (2009)  
Target
Name:
Protein kinase C theta type
Synonyms:
KPCT_HUMAN PRKCT Protein kinase C theta type (PRKCQ) nPKC-theta
Type:
Serine/threonine-protein kinase
Mol. Mass.:
81878.04
Organism:
Homo sapiens (Human)
Description:
Full-length human PKC theta (Panvera Catalog No. P2996).
Residue:
706
  
Inhibitor
Name:
BDBM29820
Synonyms:
4-indolylamino-5-phenyl-3-pyridinecarbonitrile, 7d
Type:
Small organic molecule
Emp. Form.:
C23H20N4O2
Mol. Mass.:
384.4305
SMILES:
COCCOc1cccc(c1)-c1cncc(C#N)c1Nc1cccc2[nH]ccc12
:
Substrate
Name:
PKC Peptide Substrate
Synonyms:
Type:
Fluorescent peptide
Mol. Mass.:
2051.95
Organism:
Description:
Residue:
17
FAMRFARKGSLRQKNVH