Target
Peroxisome proliferator-activated receptor alpha
Ligand
BDBM29870
Substrate
BDBM28662
Meas. Tech.
Scintillation Proximity Assay (Ki) and Cell-Based Transcription Assay (EC50)
pH
7.1±n/a
Temperature
295.15±n/a K
Ki
1200±n/a nM
EC50
>10000±n/a nM
Citation
 Connors, RVWang, ZHarrison, MZhang, AWanska, MHiscock, SFox, BDore, MLabelle, MSudom, AJohnstone, SLiu, JWalker, NPChai, ASiegler, KLi, YCoward, P Identification of a PPARdelta agonist with partial agonistic activity on PPARgamma. Bioorg Med Chem Lett 19:3550-4 (2009)  
Target
Name:
Peroxisome proliferator-activated receptor alpha
Synonyms:
NR1C1 PPAR PPAR-alpha PPARA_HUMAN Peroxisome proliferator-activated receptor | Peroxisome proliferator-activated receptor alpha (PPAR alpha)
Type:
Enzyme
Mol. Mass.:
52222.08
Organism:
Homo sapiens (Human)
Description:
Q07869
Residue:
468
  
Inhibitor
Name:
BDBM29870
Synonyms:
phenoxyacetic acid-ether, 12
Type:
Small organic molecule
Emp. Form.:
C26H22F3NO5S
Mol. Mass.:
517.517
SMILES:
Cc1c(C)c(Sc2ccc(COc3ccc(cc3)C(F)(F)F)cc2OCC#N)ccc1OCC(O)=O
:
Substrate
Name:
BDBM28662
Synonyms:
2-[4-(3-{[2-(2-chloro-6-fluorophenyl)ethyl][(2,3-dichlorophenyl)carbamoyl]amino}propyl)phenoxy]-2-methylpropanoic acid [3H]GW 2433
Type:
radiolabeled ligand
Emp. Form.:
C28H28Cl3FN2O4
Mol. Mass.:
581.89
SMILES:
CC(C)(Oc1ccc(CCCN(CCc2c(F)cccc2Cl)C(=O)Nc2cccc(Cl)c2Cl)cc1)C(O)=O
: