Target
Interleukin-1 receptor-associated kinase 4
Ligand
BDBM395305
Substrate
Meas. Tech.
IRAK4 Kinase Assay
IC50
13.3±n/a nM
Citation
 Bothe, USiebeneicher, HSchmidt, NNubbemeyer, RBömer, UGünther, JSteuber, HLange, MStegmann, CSutter, ARausch, AFriedrich, CHauff, P Substituted indazoles, methods for the production thereof, pharmaceutical preparations that contain said new substituted indazoles, and use of said new substituted indazoles to produce drugs US Patent  US10308634 Publication Date 6/4/2019 
Target
Name:
Interleukin-1 receptor-associated kinase 4
Synonyms:
IRAK-4 IRAK4_HUMAN Interleukin-1 receptor-associated kinase 4 (IRAK4) | Renal carcinoma antigen NY-REN-64
Type:
Protein
Mol. Mass.:
51519.08
Organism:
Homo sapiens (Human)
Description:
Q9NWZ3
Residue:
460
  
Inhibitor
Name:
BDBM395305
Synonyms:
N-[2-(3-Hydroxy-3-methylbutyl)-6-(2-hydroxypropan-2-yl)-2H-indazol-5-yl]-6-methylpyridine-2-carboxamide US10793545, Example 20
Type:
Small organic molecule
Emp. Form.:
C22H28N4O3
Mol. Mass.:
396.4827
SMILES:
Cc1cccc(n1)C(=O)Nc1cc2cn(CCC(C)(C)O)nc2cc1C(C)(C)O
: