Target
Mitogen-activated protein kinase kinase kinase 8
Ligand
BDBM29904
Substrate
Dual specificity mitogen-activated protein kinase kinase 1
Meas. Tech.
Tpl2/Cot ELISA Assay
pH
7.2±n/a
Temperature
303.15±n/a K
IC50
61±n/a nM
Citation
 Wu, JGreen, NHotchandani, RHu, YCondon, JHuang, AKaila, NLi, HQGuler, SLi, WTam, SYWang, QPelker, JMarusic, SHsu, SPerry Hall, JTelliez, JBCui, JLin, LL Selective inhibitors of tumor progression loci-2 (Tpl2) kinase with potent inhibition of TNF-alpha production in human whole blood. Bioorg Med Chem Lett 19:3485-8 (2009)  
Target
Name:
Mitogen-activated protein kinase kinase kinase 8
Synonyms:
C-COT COT proto-oncogene serine/threonine-protein kinase ESTF MAP3K8 Tumor Progression Loci-2 Kinase (COT) | Tumor progression locus 2
Type:
Serine/threonine-protein kinase
Mol. Mass.:
52916.89
Organism:
Homo sapiens (Human)
Description:
P41279
Residue:
467
  
Inhibitor
Name:
BDBM29904
Synonyms:
substituted 6-aminoquinoline-3-carbonitrile, 15
Type:
Small organic molecule
Emp. Form.:
C23H20BrClFN7
Mol. Mass.:
528.807
SMILES:
CC(C)(C)n1cc(CNc2cc(Br)c3ncc(C#N)c(Nc4ccc(F)c(Cl)c4)c3c2)nn1
:
Substrate
Name:
Dual specificity mitogen-activated protein kinase kinase 1
Synonyms:
GST fusion of MAP kinase kinase 1 MAP2K1 MP2K1_RABIT glutathione S-transferase-MAP kinase kinase 1
Type:
Other Protein Type
Mol. Mass.:
43453
Organism:
Oryctolagus cuniculus (rabbit)
Description:
Rabbit MEK1 was purchased from Millipore.
Residue:
393