Target
Diacylglycerol O-acyltransferase 1
Ligand
BDBM395327
Substrate
Meas. Tech.
Measurement of DGAT1 Inhibitory Activity
IC50
0.940±n/a nM
Citation
 Saruta, KHayashi, NSakurai, OSawamoto, HOoboki, E Aromatic heterocyclic compound US Patent  US10308636 Publication Date 6/4/2019 
Target
Name:
Diacylglycerol O-acyltransferase 1
Synonyms:
ACAT-related gene product 1 Acyl coA-diacylglycerol acyl transferase 1 (DGAT1) DGAT1 Diacylglycerol Acyltransferase (DGAT1) Diacylglycerol O-acyltransferase 1 (DGAT1) | Diglyceride acyltransferase
Type:
Protein
Mol. Mass.:
55297.82
Organism:
Homo sapiens (Human)
Description:
O75907
Residue:
488
  
Inhibitor
Name:
BDBM395327
Synonyms:
US10308636, Example 4-15
Type:
Small organic molecule
Emp. Form.:
C25H25N5O3
Mol. Mass.:
443.4977
SMILES:
CCC(CC)(COc1cnc(cn1)-c1ccc(nc1)-c1ncc([nH]1)-c1ccccc1)C(O)=O
: