Target
Diacylglycerol O-acyltransferase 1
Ligand
BDBM395343
Substrate
Meas. Tech.
Measurement of DGAT1 Inhibitory Activity
IC50
29.0±n/a nM
Citation
 Saruta, KHayashi, NSakurai, OSawamoto, HOoboki, E Aromatic heterocyclic compound US Patent  US10308636 Publication Date 6/4/2019 
Target
Name:
Diacylglycerol O-acyltransferase 1
Synonyms:
ACAT-related gene product 1 Acyl coA-diacylglycerol acyl transferase 1 (DGAT1) DGAT1 Diacylglycerol Acyltransferase (DGAT1) Diacylglycerol O-acyltransferase 1 (DGAT1) | Diglyceride acyltransferase
Type:
Protein
Mol. Mass.:
55297.82
Organism:
Homo sapiens (Human)
Description:
O75907
Residue:
488
  
Inhibitor
Name:
BDBM395343
Synonyms:
US10308636, Example 30
Type:
Small organic molecule
Emp. Form.:
C26H34ClN3O4Si
Mol. Mass.:
516.104
SMILES:
COC(=O)C(C)(C)COc1ccc(cc1)-c1ccc(cn1)-c1nc(Cl)cn1COCC[Si](C)(C)C
: