Target
Diacylglycerol O-acyltransferase 1
Ligand
BDBM395351
Substrate
Meas. Tech.
Measurement of DGAT1 Inhibitory Activity
IC50
20.0±n/a nM
Citation
 Saruta, KHayashi, NSakurai, OSawamoto, HOoboki, E Aromatic heterocyclic compound US Patent  US10308636 Publication Date 6/4/2019 
Target
Name:
Diacylglycerol O-acyltransferase 1
Synonyms:
ACAT-related gene product 1 Acyl coA-diacylglycerol acyl transferase 1 (DGAT1) DGAT1 Diacylglycerol Acyltransferase (DGAT1) Diacylglycerol O-acyltransferase 1 (DGAT1) | Diglyceride acyltransferase
Type:
Protein
Mol. Mass.:
55297.82
Organism:
Homo sapiens (Human)
Description:
O75907
Residue:
488
  
Inhibitor
Name:
BDBM395351
Synonyms:
US10308636, Example 38-5
Type:
Small organic molecule
Emp. Form.:
C23H27N5
Mol. Mass.:
373.494
SMILES:
Cc1ccc(cc1)N1CCN(CC1)c1ccc(cn1)-c1nc(c[nH]1)C1CCC1
: