Target
Diacylglycerol O-acyltransferase 1
Ligand
BDBM395352
Substrate
Meas. Tech.
Measurement of DGAT1 Inhibitory Activity
IC50
16.0±n/a nM
Citation
 Saruta, KHayashi, NSakurai, OSawamoto, HOoboki, E Aromatic heterocyclic compound US Patent  US10308636 Publication Date 6/4/2019 
Target
Name:
Diacylglycerol O-acyltransferase 1
Synonyms:
ACAT-related gene product 1 Acyl coA-diacylglycerol acyl transferase 1 (DGAT1) DGAT1 Diacylglycerol Acyltransferase (DGAT1) Diacylglycerol O-acyltransferase 1 (DGAT1) | Diglyceride acyltransferase
Type:
Protein
Mol. Mass.:
55297.82
Organism:
Homo sapiens (Human)
Description:
O75907
Residue:
488
  
Inhibitor
Name:
BDBM395352
Synonyms:
US10308636, Example 39
Type:
Small organic molecule
Emp. Form.:
C27H36F3N5O2Si
Mol. Mass.:
547.6877
SMILES:
C[Si](C)(C)CCOCn1cc(nc1-c1ccc(nc1)N1CCN(CC1)c1ccc(CCO)cc1)C(F)(F)F
: