Target
Diacylglycerol O-acyltransferase 1
Ligand
BDBM395372
Substrate
Meas. Tech.
Measurement of DGAT1 Inhibitory Activity
IC50
2.60±n/a nM
Citation
 Saruta, KHayashi, NSakurai, OSawamoto, HOoboki, E Aromatic heterocyclic compound US Patent  US10308636 Publication Date 6/4/2019 
Target
Name:
Diacylglycerol O-acyltransferase 1
Synonyms:
ACAT-related gene product 1 Acyl coA-diacylglycerol acyl transferase 1 (DGAT1) DGAT1 Diacylglycerol Acyltransferase (DGAT1) Diacylglycerol O-acyltransferase 1 (DGAT1) | Diglyceride acyltransferase
Type:
Protein
Mol. Mass.:
55297.82
Organism:
Homo sapiens (Human)
Description:
O75907
Residue:
488
  
Inhibitor
Name:
BDBM395372
Synonyms:
US10308636, Example 59
Type:
Small organic molecule
Emp. Form.:
C14H10BrN3
Mol. Mass.:
300.153
SMILES:
Brc1ccc(cc1)-c1nnc([nH]1)-c1ccccc1
: