Target
Renin
Ligand
BDBM29947
Substrate
Renin Substrate
Meas. Tech.
Fluorescence Resonance Energy Transfer (FRET) Assay
pH
7±n/a
Temperature
295.15±n/a K
IC50
13±n/a nM
Citation
 Tice, CMXu, ZYuan, JSimpson, RDCacatian, STFlaherty, PTZhao, WGuo, JIshchenko, ASingh, SBWu, ZScott, BBBukhtiyarov, YBerbaum, JMason, JPanemangalore, RCappiello, MGMüller, DHarrison, RKMcGeehan, GMDillard, LWBaldwin, JJClaremon, DA Design and optimization of renin inhibitors: Orally bioavailable alkyl amines. Bioorg Med Chem Lett 19:3541-5 (2009)  
Target
Name:
Renin
Synonyms:
Angiotensinogenase RENI_HUMAN
Type:
Enzyme
Mol. Mass.:
45058.99
Organism:
Homo sapiens (Human)
Description:
Residue:
406
  
Inhibitor
Name:
BDBM29947
Synonyms:
piperidine-1-carboxamide, 21j
Type:
Small organic molecule
Emp. Form.:
C29H49N3O4
Mol. Mass.:
503.7171
SMILES:
[H][C@]1(CCCN(C1)C(=O)N[C@H](CNC)CC1CCCCC1)[C@@](O)(CCCCOC)c1cccc(OC)c1
:
Substrate
Name:
Renin Substrate
Synonyms:
Type:
FRET peptide substrate
Mol. Mass.:
4889.99
Organism:
Description:
Residue:
44