Target
Mitogen-activated protein kinase kinase kinase kinase 1
Ligand
BDBM283427
Substrate
Meas. Tech.
In Vitro Enzyme Inhibition
IC50
<100±n/a nM
Citation
 McDonald, AQian, S Therapeutic inhibitory compounds US Patent  US10308637 Publication Date 6/4/2019 
Target
Name:
Mitogen-activated protein kinase kinase kinase kinase 1
Synonyms:
HPK1 MAP4K1
Type:
PROTEIN
Mol. Mass.:
91316.07
Organism:
Homo sapiens (Human)
Description:
ChEMBL_586597
Residue:
833
  
Inhibitor
Name:
BDBM283427
Synonyms:
6-((4-(((1-aminoisoquinolin-6- yl)methyl)carbamoyl)pyridin-2-yl)methyl)-3- methylquinoline-8-carboxamide US10266515, Example 79 US11021463, Example 79 | US9611252, Example 79
Type:
Small organic molecule
Emp. Form.:
C28H24N6O2
Mol. Mass.:
476.5292
SMILES:
Cc1cnc2c(cc(Cc3cc(ccn3)C(=O)NCc3ccc4c(N)nccc4c3)cc2c1)C(N)=O
: