Target
Mitogen-activated protein kinase kinase kinase kinase 1
Ligand
BDBM283465
Substrate
Meas. Tech.
In Vitro Enzyme Inhibition
IC50
<100±n/a nM
Citation
 McDonald, AQian, S Therapeutic inhibitory compounds US Patent  US10308637 Publication Date 6/4/2019 
Target
Name:
Mitogen-activated protein kinase kinase kinase kinase 1
Synonyms:
HPK1 MAP4K1
Type:
PROTEIN
Mol. Mass.:
91316.07
Organism:
Homo sapiens (Human)
Description:
ChEMBL_586597
Residue:
833
  
Inhibitor
Name:
BDBM283465
Synonyms:
N-((6-amino-2-methylpyridin-3-yl)methyl)-2- ((6-methylquinolin-3-yl)methyl)isonicotinamide US10266515, Example 117 US11021463, Example 117 | US9611252, Example 117
Type:
Small organic molecule
Emp. Form.:
C24H23N5O
Mol. Mass.:
397.4723
SMILES:
Cc1ccc2ncc(Cc3cc(ccn3)C(=O)NCc3ccc(N)nc3C)cc2c1
: