Target
Mitogen-activated protein kinase kinase kinase kinase 1
Ligand
BDBM283606
Substrate
Meas. Tech.
In Vitro Enzyme Inhibition
IC50
<100±n/a nM
Citation
 McDonald, AQian, S Therapeutic inhibitory compounds US Patent  US10308637 Publication Date 6/4/2019 
Target
Name:
Mitogen-activated protein kinase kinase kinase kinase 1
Synonyms:
HPK1 MAP4K1
Type:
PROTEIN
Mol. Mass.:
91316.07
Organism:
Homo sapiens (Human)
Description:
ChEMBL_586597
Residue:
833
  
Inhibitor
Name:
BDBM283606
Synonyms:
N-((6-amino-2-methylpyridin-3-yl)methyl)-2- ((8-(aminomethyl)-3-chloroquinolin-6- yl)methyl)isonicotinamide US10308637, Example 253
Type:
Small organic molecule
Emp. Form.:
C24H23ClN6O
Mol. Mass.:
446.932
SMILES:
Cc1nc(N)ccc1CNC(=O)c1ccnc(Cc2cc(CN)c3ncc(Cl)cc3c2)c1
: