Target
Programmed cell death 1 ligand 1 [19-238]/protein 1 [25-167]
Ligand
BDBM395554
Substrate
Meas. Tech.
PD-1/PD-L1 Homogeneous Time-Resolved Fluorescence (HTRF) Binding Assay
IC50
<10±n/a nM
Citation
 Wu, LLi, JYao, W Heterocyclic compounds as immunomodulators US Patent  US10308644 Publication Date 6/4/2019 
Target
Name:
Programmed cell death 1 ligand 1 [19-238]/protein 1 [25-167]
Synonyms:
PD-1/PD-L1
Type:
Protein
Mol. Mass.:
Description:
Components:
This complex has 2 components.
Component 1
Name:
Programmed cell death protein 1 [25-167]
Synonyms:
PD1 PDCD1_HUMAN Programmed cell death protein 1 (aa25-167) hPD-1
Type:
Enzyme Catalytic Domain
Mol. Mass.:
15954.64
Organism:
Homo sapiens (Human)
Description:
Q15116 (aa25-167)
Residue:
143
  
Component 2
Name:
Programmed cell death 1 ligand 1 [19-238]
Synonyms:
B7H1 PD-L1 PDCD1 ligand 1 PDCD1LG1 Programmed cell death 1 ligand 1 (aa19-238) hPD-L1
Type:
Enzyme Catalytic Domain
Mol. Mass.:
25191.31
Organism:
Homo sapiens (Human)
Description:
Q9NZQ7 (aa19-238)
Residue:
220
  
Inhibitor
Name:
BDBM395554
Synonyms:
(R)-1-((7-cyano-2-(3′-(3-(4,5-dihydro-1H-imidazol-2-yl)-1,7-naphthyridin-8-ylamino)-2,2′-dimethylbiphenyl-3-yl)benzo[d]oxazol-5-yl)methyl)pyrrolidine-3-carboxylic acid US10800768, Example 166
Type:
Small organic molecule
Emp. Form.:
C39H34N8O3
Mol. Mass.:
662.7391
SMILES:
Cc1c(Nc2nccc3cc(cnc23)C2=NCCN2)cccc1-c1cccc(-c2nc3cc(CN4CC[C@H](C4)C(O)=O)cc(C#N)c3o2)c1C
: