Target
Orexin receptor type 2
Ligand
BDBM395663
Substrate
Meas. Tech.
FLIPR assay
IC50
29.0±n/a nM
Citation
 Liverton, NKuduk, SDLuo, YMeng, NYu, T Piperidine oxadiazole and thiadiazole orexin receptor antagonists US Patent  US10308645 Publication Date 6/4/2019 
Target
Name:
Orexin receptor type 2
Synonyms:
HCRTR2 OX2R_HUMAN Orexin receptor type 2 (OR-2) Orexin receptor type 2 (OX2R) Ox-2-R | Ox2-R
Type:
Protein
Mol. Mass.:
50710.53
Organism:
Homo sapiens (Human)
Description:
O43614
Residue:
444
  
Inhibitor
Name:
BDBM395663
Synonyms:
(2R,5R)-5-(5-tert-butyl-1,2,4- oxadiazol-3-yl)-2-methyl-1-{[2-(2H- 1,2,3-triazol-2- yl)phenyl]carbonyl}piperidine | US10308645, Example 2
Type:
Small organic molecule
Emp. Form.:
C21H26N6O2
Mol. Mass.:
394.4701
SMILES:
C[C@@H]1CC[C@H](CN1C(=O)c1ccccc1-n1nccn1)c1noc(n1)C(C)(C)C
: