Target
cAMP-specific 3',5'-cyclic phosphodiesterase 4A
Ligand
BDBM30025
Substrate
BDBM10851
Meas. Tech.
PDE4A Inhibition Assay
pH
7.2±n/a
Temperature
295.15±n/a K
IC50
7.3±3.8 nM
Citation
 Skoumbourdis, APLeclair, CAStefan, ETurjanski, AGMaguire, WTitus, SAHuang, RAuld, DSInglese, JAustin, CPMichnick, SWXia, MThomas, CJ Exploration and optimization of substituted triazolothiadiazines and triazolopyridazines as PDE4 inhibitors. Bioorg Med Chem Lett 19:3686-92 (2009)  
Target
Name:
cAMP-specific 3',5'-cyclic phosphodiesterase 4A
Synonyms:
3',5'-cyclic phosphodiesterase PDE46 PDE4A_HUMAN Phosphodiesterase 4A | Phosphodiesterase 4A (PDE4)
Type:
Enzyme
Mol. Mass.:
98113.27
Organism:
Homo sapiens (Human)
Description:
P27815
Residue:
886
  
Inhibitor
Name:
BDBM30025
Synonyms:
triazolopyridazine, 17
Type:
Small organic molecule
Emp. Form.:
C24H24N4O5
Mol. Mass.:
448.4712
SMILES:
COc1ccc(OC)c(c1)-c1nnc2ccc(nn12)-c1ccc(OC)c(O[C@H]2CCOC2)c1
:
Substrate
Name:
BDBM10851
Synonyms:
(4aR,6R,7R,7aS)-6-(6-amino-9H-purin-9-yl)-2,7-dihydroxy-hexahydro-1,3,5,2-furo[3,2-d][1,3,2]dioxaphosphinin-2-one ADENOSINE-3 ,5 -CYCLIC-MONOPHOSPHATE cAMP | cid_23902375
Type:
Small organic molecule
Emp. Form.:
C10H12N5O6P
Mol. Mass.:
329.2059
SMILES:
Nc1ncnc2n(cnc12)[C@@H]1O[C@@H]2COP(O)(=O)O[C@H]2[C@H]1O
: