Target
cAMP-specific 3',5'-cyclic phosphodiesterase 4A
Ligand
BDBM30028
Substrate
BDBM10851
Meas. Tech.
PDE4A Inhibition Assay
pH
7.2±n/a
Temperature
295.15±n/a K
IC50
32±3 nM
Citation
 Skoumbourdis, APLeclair, CAStefan, ETurjanski, AGMaguire, WTitus, SAHuang, RAuld, DSInglese, JAustin, CPMichnick, SWXia, MThomas, CJ Exploration and optimization of substituted triazolothiadiazines and triazolopyridazines as PDE4 inhibitors. Bioorg Med Chem Lett 19:3686-92 (2009)  
Target
Name:
cAMP-specific 3',5'-cyclic phosphodiesterase 4A
Synonyms:
3',5'-cyclic phosphodiesterase PDE46 PDE4A_HUMAN Phosphodiesterase 4A | Phosphodiesterase 4A (PDE4)
Type:
Enzyme
Mol. Mass.:
98113.27
Organism:
Homo sapiens (Human)
Description:
P27815
Residue:
886
  
Inhibitor
Name:
BDBM30028
Synonyms:
triazolothiadiazine, 22
Type:
Small organic molecule
Emp. Form.:
C23H24N4O3S
Mol. Mass.:
436.527
SMILES:
COc1ccc(cc1OC1CCCC1)C1=Nn2c(SC1)nnc2-c1ccccc1OC
:
Substrate
Name:
BDBM10851
Synonyms:
(4aR,6R,7R,7aS)-6-(6-amino-9H-purin-9-yl)-2,7-dihydroxy-hexahydro-1,3,5,2-furo[3,2-d][1,3,2]dioxaphosphinin-2-one ADENOSINE-3 ,5 -CYCLIC-MONOPHOSPHATE cAMP | cid_23902375
Type:
Small organic molecule
Emp. Form.:
C10H12N5O6P
Mol. Mass.:
329.2059
SMILES:
Nc1ncnc2n(cnc12)[C@@H]1O[C@@H]2COP(O)(=O)O[C@H]2[C@H]1O
: