Target
Tumor necrosis factor
Ligand
BDBM395752
Substrate
Meas. Tech.
TNF induced HEK-Blue assay
IC50
<1000±n/a nM
Citation
 Wrobleski, STBrown, GDLin, SDuan, JLu, ZDhar, MTXiao, HTebben, AJ Tricyclic heterocyclic compounds useful as inhibitors of TNF US Patent  US10308652 Publication Date 6/4/2019 
Target
Name:
Tumor necrosis factor
Synonyms:
Cachectin TNF-a TNFA TNFSF2 Tumor necrosis factor (TNFa) Tumor necrosis factor ligand superfamily member 2 Tumor necrosis factor, soluble form | tumor necrosis factor alpha
Type:
Enzyme
Mol. Mass.:
25645.11
Organism:
Homo sapiens (Human)
Description:
P01375
Residue:
233
  
Inhibitor
Name:
BDBM395752
Synonyms:
US10308652, Example 33
Type:
Small organic molecule
Emp. Form.:
C25H24F2N4O3
Mol. Mass.:
466.4799
SMILES:
CCCOc1ccc(cc1)-c1ccc2nc3[C@@H](O)CN[C@@H](c3n2n1)c1ccccc1OC(F)F
: