Target
Cyclin-dependent kinase/G2/mitotic-specific cyclin- 1
Ligand
BDBM395801
Substrate
Meas. Tech.
CDK Assay
IC50
550±n/a nM
Citation
 Cheng, PCao, W Preparation and use of kinase inhibitor US Patent  US10308654 Publication Date 6/4/2019 
Target
Name:
Cyclin-dependent kinase/G2/mitotic-specific cyclin- 1
Synonyms:
CDK1/B CDK1/CyclinB Cyclin-Dependent Kinase 1 (CDK1) Cyclin-dependent kinase/G2/mitotic-specific cyclin 1 | cdk1
Type:
Protein Complex
Mol. Mass.:
Description:
CDK1/Cyclin B complexes were purified from insect cells co-infected with baculovirus vectors containing each of the components.
Components:
This complex has 2 components.
Component 1
Name:
Cyclin-dependent kinase 1
Synonyms:
CDC2 CDK1 CDKN1 Cell division protein kinase 1 P34CDC2 | p34 protein kinase
Type:
Enzyme Subunit
Mol. Mass.:
34101.08
Organism:
Homo sapiens (Human)
Description:
P06493
Residue:
297
  
Component 2
Name:
G2/mitotic-specific cyclin-B1
Synonyms:
CCNB CCNB1_HUMAN
Type:
Enzyme Subunit
Mol. Mass.:
48340.95
Organism:
Homo sapiens (Human)
Description:
P14635
Residue:
433
  
Inhibitor
Name:
BDBM395801
Synonyms:
US10308654, Example 29
Type:
Small organic molecule
Emp. Form.:
C25H35N9O
Mol. Mass.:
477.6051
SMILES:
CCN(CC)C(=O)c1cc2cnc(Nc3ccc(cn3)N3CCNCC3)nc2n1N1CCCCC1
: