Target
Disintegrin and metalloproteinase domain-containing protein 17
Ligand
BDBM30134
Substrate
pro-TNF-alpha peptide
Meas. Tech.
TACE Inhibition Assay
pH
7.4±n/a
Temperature
295.15±n/a K
IC50
33±n/a nM
Citation
 Zhang, CLovering, FBehnke, MZask, ASandanayaka, VSun, LZhu, YXu, WZhang, YLevin, JI Synthesis and activity of quinolinylmethyl P1' alpha-sulfone piperidine hydroxamate inhibitors of TACE. Bioorg Med Chem Lett 19:3445-8 (2009)  
Target
Name:
Disintegrin and metalloproteinase domain-containing protein 17
Synonyms:
ADA17_HUMAN CSVP Disintegrin and metalloproteinase domain-containing protein 17 (ADAM17) TNF-alpha convertase TNF-alpha-converting enzyme (TACE) Tumor necrosis factor-α converting enzyme (TACE)
Type:
Enzyme
Mol. Mass.:
93007.89
Organism:
Homo sapiens (Human)
Description:
Residue:
824
  
Inhibitor
Name:
BDBM30134
Synonyms:
alpha-sulfone piperidine hydroxamate, 11a
Type:
Small organic molecule
Emp. Form.:
C23H25N3O5S
Mol. Mass.:
455.527
SMILES:
Cc1cc(COc2ccc(cc2)S(=O)(=O)C2(CCNCC2)C(=O)NO)c2ccccc2n1
:
Substrate
Name:
pro-TNF-alpha peptide
Synonyms:
Type:
Fluorogenic peptide
Mol. Mass.:
1429.56
Organism:
Description:
A proprietary synthetic peptide of pro-TNF-alpha containing the minimal TACE cleavage sequence.
Residue:
14
ALAQAVRSSSRDPA