Target
72 kDa type IV collagenase
Ligand
BDBM30144
Substrate
BDBM23499
Meas. Tech.
TACE Inhibition Assay
Temperature
298.15±n/a K
IC50
62±n/a nM
Comments
extracted
Citation
 Zhang, CLovering, FBehnke, MZask, ASandanayaka, VSun, LZhu, YXu, WZhang, YLevin, JI Synthesis and activity of quinolinylmethyl P1' alpha-sulfone piperidine hydroxamate inhibitors of TACE. Bioorg Med Chem Lett 19:3445-8 (2009)  
Target
Name:
72 kDa type IV collagenase
Synonyms:
72 kDa gelatinase CLG4A Gelatinase A (MMP-2) MMP2_HUMAN Matrix metalloproteinase-2 (MMP 2) Matrix metalloproteinases 2 (MMP-2) | TBE-1
Type:
Enzyme
Mol. Mass.:
73870.36
Organism:
Homo sapiens (Human)
Description:
P08253
Residue:
660
  
Inhibitor
Name:
BDBM30144
Synonyms:
CHEMBL212481 | beta-sulfone piperidine hydroxamate, 2c
Type:
Small organic molecule
Emp. Form.:
C24H26N2O6S
Mol. Mass.:
470.538
SMILES:
CC#CCOc1ccc(cc1)S(=O)(=O)CC1(CCN(CC1)C(=O)c1ccccc1)C(=O)NO
:
Substrate
Name:
BDBM23499
Synonyms:
7-methoxycoumarin-PQGL-(3-[2,4-dinitrophenyl]-L-2,3-diaminopropionyl)-AR-OH | Wammp-5
Type:
Fluorogenic substrate
Emp. Form.:
Mol. Mass.:
SMILES:
: