Target
Cannabinoid receptor 2
Ligand
BDBM395816
Substrate
Meas. Tech.
Radioligand Binding Assay
EC50
19.8±n/a nM
Citation
 Gavelle, OGrether, UKimbara, ANettekoven, MStephan, RRogers-Evans, MRombach, DSchulz-Gasch, T Pyridine derivatives US Patent  US10308659 Publication Date 6/4/2019 
Target
Name:
Cannabinoid receptor 2
Synonyms:
CANNABINOID CB2 CB2 CB2B CNR2_HUMAN Cannabinoid CB2 receptor Cannabinoid receptor 2 (CB2R) | hCB2
Type:
G Protein-Coupled Receptor (GPCR)
Mol. Mass.:
39690.94
Organism:
Homo sapiens (Human)
Description:
P34972
Residue:
360
  
Inhibitor
Name:
BDBM395816
Synonyms:
3-cyclopropyl-5-[5-(3,3-difluoroazetidin-1-yl)-4-(2,2,2-trifluoroethoxy)pyridin-2-yl]-1,2,4-oxadiazole | US10308659, Example 15
Type:
Small organic molecule
Emp. Form.:
C17H18F2N4O2
Mol. Mass.:
348.3472
SMILES:
FC1(F)CN(C1)c1cnc(cc1OCC1CC1)-c1noc(n1)C1CC1
: