Target
Cannabinoid receptor 2
Ligand
BDBM395818
Substrate
Meas. Tech.
Radioligand Binding Assay
EC50
20.5±n/a nM
Citation
 Gavelle, OGrether, UKimbara, ANettekoven, MStephan, RRogers-Evans, MRombach, DSchulz-Gasch, T Pyridine derivatives US Patent  US10308659 Publication Date 6/4/2019 
Target
Name:
Cannabinoid receptor 2
Synonyms:
CANNABINOID CB2 CB2 CB2B CNR2_HUMAN Cannabinoid CB2 receptor Cannabinoid receptor 2 (CB2R) | hCB2
Type:
G Protein-Coupled Receptor (GPCR)
Mol. Mass.:
39690.94
Organism:
Homo sapiens (Human)
Description:
P34972
Residue:
360
  
Inhibitor
Name:
BDBM395818
Synonyms:
3-tert-butyl-5-[5-(3,3-difluoroazetidin-1-yl)-4-(2,2,2-trifluoroethoxy)pyridin-2-yl]-1,2,4-oxadiazole | US10308659, Example 17
Type:
Small organic molecule
Emp. Form.:
C16H17F5N4O2
Mol. Mass.:
392.3238
SMILES:
CC(C)(C)c1noc(n1)-c1cc(OCC(F)(F)F)c(cn1)N1CC(F)(F)C1
: