Target
Cannabinoid receptor 2
Ligand
BDBM395820
Substrate
Meas. Tech.
Radioligand Binding Assay
EC50
13.7±n/a nM
Citation
 Gavelle, OGrether, UKimbara, ANettekoven, MStephan, RRogers-Evans, MRombach, DSchulz-Gasch, T Pyridine derivatives US Patent  US10308659 Publication Date 6/4/2019 
Target
Name:
Cannabinoid receptor 2
Synonyms:
CANNABINOID CB2 CB2 CB2B CNR2_HUMAN Cannabinoid CB2 receptor Cannabinoid receptor 2 (CB2R) | hCB2
Type:
G Protein-Coupled Receptor (GPCR)
Mol. Mass.:
39690.94
Organism:
Homo sapiens (Human)
Description:
P34972
Residue:
360
  
Inhibitor
Name:
BDBM395820
Synonyms:
3-[5-cyclopropyl-4-(cyclopropylmethoxy)pyridin-2-yl]-5-(trifluoromethyl)-1,2,4-oxadiazole | US10308659, Example 19
Type:
Small organic molecule
Emp. Form.:
C15H14F3N3O2
Mol. Mass.:
325.2858
SMILES:
FC(F)(F)c1nc(no1)-c1cc(OCC2CC2)c(cn1)C1CC1
: