Target
Cannabinoid receptor 1
Ligand
BDBM395821
Substrate
Meas. Tech.
Radioligand Binding Assay
EC50
>10000±n/a nM
Citation
 Gavelle, OGrether, UKimbara, ANettekoven, MStephan, RRogers-Evans, MRombach, DSchulz-Gasch, T Pyridine derivatives US Patent  US10308659 Publication Date 6/4/2019 
Target
Name:
Cannabinoid receptor 1
Synonyms:
CANN6 CB-R CNR CNR1_HUMAN Cannabinoid receptor Cannabinoid receptor 1 (brain)
Type:
G Protein-Coupled Receptor (GPCR)
Mol. Mass.:
52868.96
Organism:
Homo sapiens (Human)
Description:
P21554
Residue:
472
  
Inhibitor
Name:
BDBM395821
Synonyms:
(4S)-4-tert-butyl-2-[5-cyclopropyl-4-(cyclopropylmethoxy)pyridin-2-yl]-4,5-dihydro-1,3-oxazole | US10308659, Example 20
Type:
Small organic molecule
Emp. Form.:
C19H26N2O2
Mol. Mass.:
314.4219
SMILES:
CC(C)(C)[C@H]1COC(=N1)c1cc(OCC2CC2)c(cn1)C1CC1
: