Target
Tyrosine-protein phosphatase non-receptor type 11
Ligand
BDBM395957
Substrate
Meas. Tech.
SHP2 Allosteric Inhibition Assay
IC50
40.0±n/a nM
Citation
 Chen, ZFortanet, JGLaMarche, MJSendzik, MTamez, Jr., VYu, B Compounds and compositions for inhibiting the activity of SHP2 US Patent  US10308660 Publication Date 6/4/2019 
Target
Name:
Tyrosine-protein phosphatase non-receptor type 11
Synonyms:
PTN11_HUMAN PTP-2C PTPN11 Protein tyrosine phosphatase (PTP) Shp2 Protein-tyrosine phosphatase 2C SHP2 Src homology phosphatase 2 (SHP-2) Tyrosine-protein phosphatase non-receptor type 11 (PTPN11) Tyrosine-protein phosphatase non-receptor type 11 (SHP2)
Type:
Protein phosphatase
Mol. Mass.:
68443.59
Organism:
Homo sapiens (Human)
Description:
Q06124
Residue:
597
  
Inhibitor
Name:
BDBM395957
Synonyms:
US10308660, Example 33
Type:
Small organic molecule
Emp. Form.:
C21H25F5N6OS
Mol. Mass.:
504.52
SMILES:
C[C@@H]1CC2(CCN(CC2)c2nc(N)c(Sc3cccnc3C(F)(F)F)c(=O)n2C)[C@H](N)C1(F)F
: