Target
Tyrosine-protein phosphatase non-receptor type 11
Ligand
BDBM396071
Substrate
Meas. Tech.
SHP2 Allosteric Inhibition Assay
IC50
175±n/a nM
Citation
 Chen, ZFortanet, JGLaMarche, MJSendzik, MTamez, Jr., VYu, B Compounds and compositions for inhibiting the activity of SHP2 US Patent  US10308660 Publication Date 6/4/2019 
Target
Name:
Tyrosine-protein phosphatase non-receptor type 11
Synonyms:
PTN11_HUMAN PTP-2C PTPN11 Protein tyrosine phosphatase (PTP) Shp2 Protein-tyrosine phosphatase 2C SHP2 Src homology phosphatase 2 (SHP-2) Tyrosine-protein phosphatase non-receptor type 11 (PTPN11) Tyrosine-protein phosphatase non-receptor type 11 (SHP2)
Type:
Protein phosphatase
Mol. Mass.:
68443.59
Organism:
Homo sapiens (Human)
Description:
Q06124
Residue:
597
  
Inhibitor
Name:
BDBM396071
Synonyms:
US10308660, Example 173
Type:
Small organic molecule
Emp. Form.:
C22H31N5O3
Mol. Mass.:
413.5132
SMILES:
COc1ccc(cc1C)-c1c(N)nc(N2CCC3(CO[C@@H](C)[C@H]3N)CC2)n(C)c1=O
: