Target
Melanin-concentrating hormone receptor 1
Ligand
BDBM30168
Substrate
BDBM30157
Meas. Tech.
Radioligand Binding Assay
pH
7.4±n/a
Temperature
295.15±n/a K
IC50
23±n/a nM
Citation
 Moriya, MKishino, HSakuraba, SSakamoto, TSuga, TTakahashi, HSuzuki, TIto, MIto, JMoriya, RTakenaga, NIwaasa, HIshihara, AKanatani, AFukami, T Identification of 2-aminobenzimidazoles as potent melanin-concentrating hormone 1-receptor (MCH1R) antagonists. Bioorg Med Chem Lett 19:3568-72 (2009)  
Target
Name:
Melanin-concentrating hormone receptor 1
Synonyms:
G-protein coupled receptor 24 MCH receptor 1 MCH-R1 MCHR-1 MCHR1_HUMAN Melanin-Concentrating Hormone Receptor 1 (MCH1R) Melanin-concentrating hormone receptor 1 (MCH-1) Melanin-concentrating hormone receptor 1 (MCHR-1) SLC-1 Somatostatin receptor-like protein
Type:
G Protein-Coupled Receptor (GPCR)
Mol. Mass.:
45976.27
Organism:
Homo sapiens (Human)
Description:
Membranes from CHO-K1 cells stably expressing human MCH1R were used in assays.
Residue:
422
  
Inhibitor
Name:
BDBM30168
Synonyms:
2-aminobenzimidazole-based compound, 16
Type:
Small organic molecule
Emp. Form.:
C24H28F3N5O
Mol. Mass.:
459.5072
SMILES:
CN(C1CCN(C)CC1)c1nc2ccc(NC(=O)CCc3ccc(cc3)C(F)(F)F)cc2[nH]1
:
Substrate
Name:
BDBM30157
Synonyms:
Melanin-Concentrating Hormone (Human), [125I] | [125I]-MCH
Type:
radiolabeled substrate
Emp. Form.:
Mol. Mass.:
SMILES:
: