Target
MAP kinase-activated protein kinase 2
Ligand
BDBM30183
Substrate
HSP27 Peptide
Meas. Tech.
MK-2 IC50 Value Determination
pH
7.5±n/a
Temperature
303.15±n/a K
IC50
52±12 nM
Citation
 Anderson, DRMeyers, MJVernier, WFMahoney, MWKurumbail, RGCaspers, NPoda, GISchindler, JFReitz, DBMourey, RJ Pyrrolopyridine inhibitors of mitogen-activated protein kinase-activated protein kinase 2 (MK-2). J Med Chem 50:2647-54 (2007)  
Target
Name:
MAP kinase-activated protein kinase 2
Synonyms:
MAP kinase-activated protein kinase 2 (MAPKAPK2) MAP kinase-activated protein kinase 2 (p38/MK2) MAPK-activated protein kinase 2 MAPKAP kinase 2 MAPKAPK2 | MK2
Type:
Serine/threonine-protein kinase
Mol. Mass.:
45579.87
Organism:
Homo sapiens (Human)
Description:
P49137
Residue:
400
  
Inhibitor
Name:
BDBM30183
Synonyms:
Pyrrolopyridine, 14
Type:
Small organic molecule
Emp. Form.:
C22H17N3O
Mol. Mass.:
339.3899
SMILES:
O=C1NCCc2[nH]c(cc12)-c1ccnc(c1)-c1ccc2ccccc2c1
:
Substrate
Name:
HSP27 Peptide
Synonyms:
Type:
Peptide
Mol. Mass.:
1389.69
Organism:
Description:
Residue:
13
KKKALSRNLSVAA