Target
MAP kinase-activated protein kinase 2
Ligand
BDBM30191
Substrate
HSP27 Peptide
Meas. Tech.
MK-2 IC50 Value Determination
pH
7.5±n/a
Temperature
303.15±n/a K
IC50
32±6 nM
Citation
 Anderson, DRMeyers, MJVernier, WFMahoney, MWKurumbail, RGCaspers, NPoda, GISchindler, JFReitz, DBMourey, RJ Pyrrolopyridine inhibitors of mitogen-activated protein kinase-activated protein kinase 2 (MK-2). J Med Chem 50:2647-54 (2007)  
Target
Name:
MAP kinase-activated protein kinase 2
Synonyms:
MAP kinase-activated protein kinase 2 (MAPKAPK2) MAP kinase-activated protein kinase 2 (p38/MK2) MAPK-activated protein kinase 2 MAPKAP kinase 2 MAPKAPK2 | MK2
Type:
Serine/threonine-protein kinase
Mol. Mass.:
45579.87
Organism:
Homo sapiens (Human)
Description:
P49137
Residue:
400
  
Inhibitor
Name:
BDBM30191
Synonyms:
Pyrrolopyridine, 22
Type:
Small organic molecule
Emp. Form.:
C18H14ClN3O
Mol. Mass.:
323.776
SMILES:
Clc1ccc(cc1)-c1cc(ccn1)-c1cc2c(CCNC2=O)[nH]1
:
Substrate
Name:
HSP27 Peptide
Synonyms:
Type:
Peptide
Mol. Mass.:
1389.69
Organism:
Description:
Residue:
13
KKKALSRNLSVAA