Target
MAP kinase-activated protein kinase 2
Ligand
BDBM30202
Substrate
HSP27 Peptide
Meas. Tech.
MK-2 IC50 Value Determination
IC50
8±n/a nM
Citation
 Anderson, DRMeyers, MJVernier, WFMahoney, MWKurumbail, RGCaspers, NPoda, GISchindler, JFReitz, DBMourey, RJ Pyrrolopyridine inhibitors of mitogen-activated protein kinase-activated protein kinase 2 (MK-2). J Med Chem 50:2647-54 (2007)  
Target
Name:
MAP kinase-activated protein kinase 2
Synonyms:
MAP kinase-activated protein kinase 2 (MAPKAPK2) MAP kinase-activated protein kinase 2 (p38/MK2) MAPK-activated protein kinase 2 MAPKAP kinase 2 MAPKAPK2 | MK2
Type:
Serine/threonine-protein kinase
Mol. Mass.:
45579.87
Organism:
Homo sapiens (Human)
Description:
P49137
Residue:
400
  
Inhibitor
Name:
BDBM30202
Synonyms:
Pyrrolopyridine, 33
Type:
Small organic molecule
Emp. Form.:
C24H24N4O2
Mol. Mass.:
400.473
SMILES:
O=C(NC1CCCC1)c1ccc(cc1)-c1cc(ccn1)-c1cc2c(CCNC2=O)[nH]1
:
Substrate
Name:
HSP27 Peptide
Synonyms:
Type:
Peptide
Mol. Mass.:
1389.69
Organism:
Description:
Residue:
13
KKKALSRNLSVAA