Target
Ribosomal protein S6 kinase alpha-5
Ligand
BDBM30192
Substrate
HSP27 Peptide
Meas. Tech.
Kinase Selectivity Assay
IC50
>200000±n/a nM
Citation
 Anderson, DRMeyers, MJVernier, WFMahoney, MWKurumbail, RGCaspers, NPoda, GISchindler, JFReitz, DBMourey, RJ Pyrrolopyridine inhibitors of mitogen-activated protein kinase-activated protein kinase 2 (MK-2). J Med Chem 50:2647-54 (2007)  
Target
Name:
Ribosomal protein S6 kinase alpha-5
Synonyms:
90 kDa ribosomal protein S6 kinase 5 MSK1 Nuclear mitogen- and stress-activated protein kinase 1 RPS6KA5 RSK-like protein kinase Ribosomal protein S6 kinase Ribosomal protein S6 kinase alpha-5
Type:
Serine/threonine-protein kinase
Mol. Mass.:
89874.44
Organism:
Homo sapiens (Human)
Description:
Residue:
802
  
Inhibitor
Name:
BDBM30192
Synonyms:
Pyrrolopyridine, 23
Type:
Small organic molecule
Emp. Form.:
C18H14FN3O
Mol. Mass.:
307.3217
SMILES:
Fc1ccccc1-c1cc(ccn1)-c1cc2c(CCNC2=O)[nH]1
:
Substrate
Name:
HSP27 Peptide
Synonyms:
Type:
Peptide
Mol. Mass.:
1389.69
Organism:
Description:
Residue:
13
KKKALSRNLSVAA